Target
Androgen receptor
Ligand
BDBM50257310
Substrate
Meas. Tech.
ChEMBL_1689751 (CHEMBL4040321)
IC50
167±n/a nM
Citation
 Unwalla, RMousseau, JJFadeyi, OOChoi, CParris, KHu, BKenney, TChippari, SMcNally, CVishwanathan, KKilbourne, EThompson, CNagpal, SWrobel, JYudt, MMorris, CAPowell, DGilbert, AMChekler, ELP Structure-Based Approach To Identify 5-[4-Hydroxyphenyl]pyrrole-2-carbonitrile Derivatives as Potent and Tissue Selective Androgen Receptor Modulators. J Med Chem 60:6451-6457 (2017)  
Target
Name:
Androgen receptor
Synonyms:
ANDR_HUMAN Androgen Receptor Androgen receptor/Baculoviral IAP repeat-containing protein 2 Dihydrotestosterone receptor Nuclear receptor subfamily 3 group C member 4
Type:
Receptor
Mol. Mass.:
99185.27
Organism:
Homo sapiens (Human)
Description:
CHO cells were stably transfected with human AR gene.
Residue:
920
  
Inhibitor
Name:
BDBM50257310
Synonyms:
CHEMBL4073869
Type:
Small organic molecule
Emp. Form.:
C12H9BrN2O
Mol. Mass.:
277.117
SMILES:
Cn1c(cc(Br)c1-c1ccc(O)cc1)C#N
: