Target
Aminopeptidase N
Ligand
BDBM50008434
Substrate
Meas. Tech.
ChEMBL_123004 (CHEMBL729045)
Ki
260000±n/a nM
Citation
 Ocain, TDRich, DH alpha-Keto amide inhibitors of aminopeptidases. J Med Chem 35:451-6 (1992)  
Target
Name:
Aminopeptidase N
Synonyms:
AMPN_HUMAN APN Aminopeptidase CD_antigen=CD13 Myeloid plasma membrane glycoprotein CD13 gp150 | hAPN
Type:
PROTEIN
Mol. Mass.:
109522.63
Organism:
Homo sapiens (Human)
Description:
ChEMBL_1507526
Residue:
967
  
Inhibitor
Name:
BDBM50008434
Synonyms:
5-Amino-2-benzyl-7-methyl-4-oxo-octanoic acid | CHEMBL140459
Type:
Small organic molecule
Emp. Form.:
C16H23NO3
Mol. Mass.:
277.3587
SMILES:
CC(C)C[C@H](N)C(=O)CC(Cc1ccccc1)C(O)=O
: