Target
Aminopeptidase N
Ligand
BDBM50008429
Substrate
Meas. Tech.
ChEBML_123004
Ki
430000±n/a nM
Citation
 Ocain, TDRich, DH alpha-Keto amide inhibitors of aminopeptidases. J Med Chem 35:451-6 (1992)  
Target
Name:
Aminopeptidase N
Synonyms:
AMPN_HUMAN APN Aminopeptidase CD_antigen=CD13 Myeloid plasma membrane glycoprotein CD13 gp150 | hAPN
Type:
PROTEIN
Mol. Mass.:
109522.63
Organism:
Homo sapiens (Human)
Description:
ChEMBL_1507526
Residue:
967
  
Inhibitor
Name:
BDBM50008429
Synonyms:
(3S)-3-amino-5-methylhexan-2-one CHEMBL342867
Type:
Small organic molecule
Emp. Form.:
C7H15NO
Mol. Mass.:
129.2001
SMILES:
CC(C)C[C@H](N)C(C)=O
: