Target
Aminopeptidase B
Ligand
BDBM50008433
Substrate
Meas. Tech.
ChEBML_36049
Ki
3200.0±n/a nM
Citation
 Ocain, TDRich, DH alpha-Keto amide inhibitors of aminopeptidases. J Med Chem 35:451-6 (1992)  
Target
Name:
Aminopeptidase B
Synonyms:
AMPB_HUMAN Aminopeptidase Arginine aminopeptidase RNPEP
Type:
PROTEIN
Mol. Mass.:
72586.33
Organism:
Homo sapiens (Human)
Description:
ChEMBL_36048
Residue:
650
  
Inhibitor
Name:
BDBM50008433
Synonyms:
3-Amino-5-methyl-2-oxo-hexanoic acid (3-methyl-butyl)-amide | CHEMBL140846
Type:
Small organic molecule
Emp. Form.:
C12H24N2O2
Mol. Mass.:
228.3312
SMILES:
CC(C)CCNC(=O)C(=O)[C@@H](N)CC(C)C
: