Target
Renin
Ligand
BDBM50230367
Substrate
Meas. Tech.
ChEMBL_195764 (CHEMBL803430)
IC50
50±n/a nM
Citation
 Kleemann, HWHeitsch, HHenning, RKramer, WKocher, WLerch, ULinz, WNickel, WURuppert, DUrbach, H Renin inhibitory pentols showing improved enteral bioavailability. J Med Chem 35:559-67 (1992)  
Target
Name:
Renin
Synonyms:
Angiotensinogenase RENI_HUMAN
Type:
Enzyme
Mol. Mass.:
45058.99
Organism:
Homo sapiens (Human)
Description:
Residue:
406
  
Inhibitor
Name:
BDBM50230367
Synonyms:
CHEMBL3143442
Type:
Small organic molecule
Emp. Form.:
C33H56N4O8
Mol. Mass.:
636.8197
SMILES:
CCC[C@H](NC(=O)[C@H](Cc1ccccc1)NC(=O)[C@@H](N)[C@@H](C)CC)C(=O)N[C@@H](CC1CCCCC1)[C@@H](O)[C@@H](O)[C@H](O)[C@H](O)CO
: