Target
Choline O-acetyltransferase
Ligand
BDBM8960
Substrate
Meas. Tech.
ChEBML_27372
IC50
5.3±n/a nM
Citation
 Cardozo, MGIimura, YSugimoto, HYamanishi, YHopfinger, AJ QSAR analyses of the substituted indanone and benzylpiperidine rings of a series of indanone-benzylpiperidine inhibitors of acetylcholinesterase. J Med Chem 35:584-9 (1992)  
Target
Name:
Choline O-acetyltransferase
Synonyms:
CLAT_RAT Choline Acetyltransferase Choline acetylase
Type:
Enzyme Catalytic Domain
Mol. Mass.:
71875.58
Organism:
RAT
Description:
Choline Acetyltransferase 0 RAT::P32738
Residue:
640
  
Inhibitor
Name:
BDBM8960
Synonyms:
(+/-)-2-[(1-benzylpiperidin-4-yl)methyl]-5,6-dimethoxy-indan-1-one Aricept CHEMBL1678 CHEMBL502 Donepezil E2020 US9346818, DPH US9663465, Donepezil
Type:
Small organic molecule
Emp. Form.:
C24H29NO3
Mol. Mass.:
379.492
SMILES:
COc1cc2CC(CC3CCN(Cc4ccccc4)CC3)C(=O)c2cc1OC
: