Target
Acetylcholinesterase
Ligand
BDBM50008543
Substrate
Meas. Tech.
ChEMBL_29377 (CHEMBL648291)
IC50
1.8±n/a nM
Citation
 Cardozo, MGIimura, YSugimoto, HYamanishi, YHopfinger, AJ QSAR analyses of the substituted indanone and benzylpiperidine rings of a series of indanone-benzylpiperidine inhibitors of acetylcholinesterase. J Med Chem 35:584-9 (1992)  
Target
Name:
Acetylcholinesterase
Synonyms:
ACES_HUMAN Acetylcholinesterase (AChE) | Acetylcholinesterase (human AChE)
Type:
Enzyme
Mol. Mass.:
67792.70
Organism:
Homo sapiens (Human)
Description:
P22303
Residue:
614
  
Inhibitor
Name:
BDBM50008543
Synonyms:
1-hydroxy-4-methylbenzene 4-methylphenol p-Kresol p-methylphenol paracresol
Type:
Small organic molecule
Emp. Form.:
C7H8O
Mol. Mass.:
108.1378
SMILES:
Cc1ccc(O)cc1
: