Target
Acetylcholinesterase
Ligand
BDBM50008544
Substrate
Meas. Tech.
ChEMBL_29377 (CHEMBL648291)
IC50
9.5±n/a nM
Citation
 Cardozo, MGIimura, YSugimoto, HYamanishi, YHopfinger, AJ QSAR analyses of the substituted indanone and benzylpiperidine rings of a series of indanone-benzylpiperidine inhibitors of acetylcholinesterase. J Med Chem 35:584-9 (1992)  
Target
Name:
Acetylcholinesterase
Synonyms:
ACES_HUMAN Acetylcholinesterase (AChE) | Acetylcholinesterase (human AChE)
Type:
Enzyme
Mol. Mass.:
67792.70
Organism:
Homo sapiens (Human)
Description:
P22303
Residue:
614
  
Inhibitor
Name:
BDBM50008544
Synonyms:
1-Fluoro-4-methyl-benzene | CHEMBL346605
Type:
Small organic molecule
Emp. Form.:
C7H7F
Mol. Mass.:
110.1289
SMILES:
Cc1ccc(F)cc1
: