Target
Acetylcholinesterase
Ligand
BDBM50008576
Substrate
Meas. Tech.
ChEBML_29413
IC50
1.5±n/a nM
Citation
 Cardozo, MGKawai, TIimura, YSugimoto, HYamanishi, YHopfinger, AJ Conformational analyses and molecular-shape comparisons of a series of indanone-benzylpiperidine inhibitors of acetylcholinesterase. J Med Chem 35:590-601 (1992)  
Target
Name:
Acetylcholinesterase
Synonyms:
ACES_HUMAN Acetylcholinesterase (AChE) | Acetylcholinesterase (human AChE)
Type:
Enzyme
Mol. Mass.:
67792.70
Organism:
Homo sapiens (Human)
Description:
P22303
Residue:
614
  
Inhibitor
Name:
BDBM50008576
Synonyms:
2-[3-(1-Methyl-piperidin-4-yl)-propyl]-indan-1-one | CHEMBL263322
Type:
Small organic molecule
Emp. Form.:
C18H25NO
Mol. Mass.:
271.3972
SMILES:
CN1CCC(CCCC2Cc3ccccc3C2=O)CC1
: