Target
Neprilysin
Ligand
BDBM50008597
Substrate
Meas. Tech.
ChEBML_64516
IC50
8.4±n/a nM
Citation
 Mimura, TNakamura, YNishino, JSawayama, TKomiya, TDeguchi, TKita, ANakamura, HMatsumoto, J A novel class of enkephalinase inhibitors containing a C-terminal sulfo group. J Med Chem 35:602-8 (1992)  
Target
Name:
Neprilysin
Synonyms:
Mme Neprilysin Neutral endopeptidase 24.11
Type:
Protein
Mol. Mass.:
85789.59
Organism:
Rattus norvegicus (Rat)
Description:
P07861
Residue:
750
  
Inhibitor
Name:
BDBM50008597
Synonyms:
CHEMBL156099 | Sodium; 2-(2-mercaptomethyl-3-naphthalen-1-yl-propionylamino)-ethanesulfonate (1.75H2O)
Type:
Small organic molecule
Emp. Form.:
C16H18NO4S2
Mol. Mass.:
352.449
SMILES:
[O-]S(=O)(=O)CCNC(=O)C(CS)Cc1cccc2ccccc12
: