Target
Angiotensin-converting enzyme
Ligand
BDBM50008603
Substrate
Meas. Tech.
ChEMBL_34795 (CHEMBL644411)
IC50
12000±n/a nM
Citation
 Mimura, TNakamura, YNishino, JSawayama, TKomiya, TDeguchi, TKita, ANakamura, HMatsumoto, J A novel class of enkephalinase inhibitors containing a C-terminal sulfo group. J Med Chem 35:602-8 (1992)  
Target
Name:
Angiotensin-converting enzyme
Synonyms:
3.2.1.- ACE Angiotensin-converting enzyme, soluble form DCP1 Kininase II
Type:
Mol. Mass.:
150405.15
Organism:
Oryctolagus cuniculus
Description:
Residue:
1310
  
Inhibitor
Name:
BDBM50008603
Synonyms:
(2-Mercaptomethyl-3-phenyl-propionylamino)-methanesulfonic acid (1.5H2O) | CHEMBL157823
Type:
Small organic molecule
Emp. Form.:
C11H15NO4S2
Mol. Mass.:
289.371
SMILES:
OS(=O)(=O)CNC(=O)C(CS)Cc1ccccc1
: