Target
Neprilysin
Ligand
BDBM50008607
Substrate
Meas. Tech.
ChEMBL_64516 (CHEMBL677321)
IC50
5.2±n/a nM
Citation
 Mimura, TNakamura, YNishino, JSawayama, TKomiya, TDeguchi, TKita, ANakamura, HMatsumoto, J A novel class of enkephalinase inhibitors containing a C-terminal sulfo group. J Med Chem 35:602-8 (1992)  
Target
Name:
Neprilysin
Synonyms:
Mme Neprilysin Neutral endopeptidase 24.11
Type:
Protein
Mol. Mass.:
85789.59
Organism:
Rattus norvegicus (Rat)
Description:
P07861
Residue:
750
  
Inhibitor
Name:
BDBM50008607
Synonyms:
CHEMBL154766 | Sodium; 2-(2-mercaptomethyl-4-methyl-pentanoylamino)-ethanesulfonate(H2O)
Type:
Small organic molecule
Emp. Form.:
C9H18NO4S2
Mol. Mass.:
268.374
SMILES:
CC(C)CC(CS)C(=O)NCCS([O-])(=O)=O
: