Target
Neprilysin
Ligand
BDBM50008619
Substrate
Meas. Tech.
ChEBML_64516
IC50
490±n/a nM
Citation
 Mimura, TNakamura, YNishino, JSawayama, TKomiya, TDeguchi, TKita, ANakamura, HMatsumoto, J A novel class of enkephalinase inhibitors containing a C-terminal sulfo group. J Med Chem 35:602-8 (1992)  
Target
Name:
Neprilysin
Synonyms:
Mme Neprilysin Neutral endopeptidase 24.11
Type:
Protein
Mol. Mass.:
85789.59
Organism:
Rattus norvegicus (Rat)
Description:
P07861
Residue:
750
  
Inhibitor
Name:
BDBM50008619
Synonyms:
CHEMBL158290 | Sodium; 2-[(2-mercaptomethyl-3-phenyl-propionyl)-methyl-amino]-ethanesulfonate(0.25H2O)
Type:
Small organic molecule
Emp. Form.:
C13H18NO4S2
Mol. Mass.:
316.417
SMILES:
CN(CCS([O-])(=O)=O)C(=O)C(CS)Cc1ccccc1
: