Target
Neprilysin
Ligand
BDBM50008621
Substrate
Meas. Tech.
ChEMBL_64516 (CHEMBL677321)
IC50
17±n/a nM
Citation
 Mimura, TNakamura, YNishino, JSawayama, TKomiya, TDeguchi, TKita, ANakamura, HMatsumoto, J A novel class of enkephalinase inhibitors containing a C-terminal sulfo group. J Med Chem 35:602-8 (1992)  
Target
Name:
Neprilysin
Synonyms:
Mme Neprilysin Neutral endopeptidase 24.11
Type:
Protein
Mol. Mass.:
85789.59
Organism:
Rattus norvegicus (Rat)
Description:
P07861
Residue:
750
  
Inhibitor
Name:
BDBM50008621
Synonyms:
CHEMBL422339 | Sodium; 2-[2-mercaptomethyl-3-(4-nitro-phenyl)-propionylamino]-ethanesulfonate (H2O)
Type:
Small organic molecule
Emp. Form.:
C12H15N2O6S2
Mol. Mass.:
347.388
SMILES:
[O-][N+](=O)c1ccc(CC(CS)C(=O)NCCS([O-])(=O)=O)cc1
: