Target
Gastrin/cholecystokinin type B receptor
Ligand
BDBM50008630
Substrate
Meas. Tech.
ChEBML_47978
IC50
>10000±n/a nM
Citation
 Kerwin, JFWagenaar, FKopecka, HLin, CWMiller, TWitte, DStashko, MNadzan, AM Cholecystokinin antagonists: (R)-tryptophan-based hybrid antagonists of high affinity and selectivity for CCK-A receptors. J Med Chem 34:3350-9 (1992)  
Target
Name:
Gastrin/cholecystokinin type B receptor
Synonyms:
CCK-2 receptor CCK-BR CCKRB Cholecystokinin receptor GASR_HUMAN | Gastrin/cholecystokinin type B receptor
Type:
G Protein-Coupled Receptor (GPCR)
Mol. Mass.:
48445.79
Organism:
Homo sapiens (Human)
Description:
Stable expression of human CCK-2 receptors in HEK 293 cells.
Residue:
447
  
Inhibitor
Name:
BDBM50008630
Synonyms:
CHEMBL325161 | {3-(1H-Indol-3-yl)-2-[(quinoline-3-carbonyl)-amino]-propionylamino}-phenyl-acetic acid ethyl ester
Type:
Small organic molecule
Emp. Form.:
C31H28N4O4
Mol. Mass.:
520.5784
SMILES:
CCOC(=O)[C@H](NC(=O)[C@@H](Cc1c[nH]c2ccccc12)NC(=O)c1cnc2ccccc2c1)c1ccccc1
: