Target
Cholecystokinin receptor type A
Ligand
BDBM50008629
Substrate
Meas. Tech.
ChEBML_49718
IC50
5.1±n/a nM
Citation
 Kerwin, JFWagenaar, FKopecka, HLin, CWMiller, TWitte, DStashko, MNadzan, AM Cholecystokinin antagonists: (R)-tryptophan-based hybrid antagonists of high affinity and selectivity for CCK-A receptors. J Med Chem 34:3350-9 (1992)  
Target
Name:
Cholecystokinin receptor type A
Synonyms:
CCK-A receptor CCK1-R CCKAR_CAVPO Cholecystokinin receptor type A | Cholecystokinin-1 receptor
Type:
Mol. Mass.:
48229.77
Organism:
Cavia porcellus
Description:
Residue:
430
  
Inhibitor
Name:
BDBM50008629
Synonyms:
4-Dipentylcarbamoyl-4-[(quinoline-3-carbonyl)-amino]-butyric acid CHEMBL112307
Type:
Small organic molecule
Emp. Form.:
C25H35N3O4
Mol. Mass.:
441.5631
SMILES:
CCCCCN(CCCCC)C(=O)[C@@H](CCC(O)=O)NC(=O)c1cnc2ccccc2c1
: