Target
Amine oxidase [flavin-containing] B
Ligand
BDBM23556
Substrate
Meas. Tech.
ChEMBL_1690270 (CHEMBL4040840)
IC50
5.1±n/a nM
Citation
 Fonseca, AReis, JSilva, TMatos, MJBagetta, DOrtuso, FAlcaro, SUriarte, EBorges, F Coumarin versus Chromone Monoamine Oxidase B Inhibitors: Quo Vadis? J Med Chem 60:7206-7212 (2017)  
Target
Name:
Amine oxidase [flavin-containing] B
Synonyms:
AOFB_HUMAN MAOB Monoamine oxidase type B (MAO B) Monoamine oxidase type B (MAOB)
Type:
Protein
Mol. Mass.:
58768.76
Organism:
Homo sapiens (Human)
Description:
P27338
Residue:
520
  
Inhibitor
Name:
BDBM23556
Synonyms:
3-Carboxamide-coumarin deriv., 32 | N-(3-chlorophenyl)-6-methyl-2-oxo-2H-chromene-3-carboxamide
Type:
Small organic molecule
Emp. Form.:
C17H12ClNO3
Mol. Mass.:
313.735
SMILES:
Cc1ccc2oc(=O)c(cc2c1)C(=O)Nc1cccc(Cl)c1
: