Target
Thromboxane-A synthase
Ligand
BDBM50008790
Substrate
Meas. Tech.
ChEMBL_210274 (CHEMBL808521)
IC50
3±n/a nM
Citation
 Bhagwat, SSGude, CCohen, DSLee, WFurness, PClarke, FH Thromboxane receptor antagonism combined with thromboxane synthase inhibition. 1. (+/-)-(3-pyridinylbicycloheptyl)alkanoic acids. J Med Chem 34:1790-7 (1991)  
Target
Name:
Thromboxane-A synthase
Synonyms:
CYP5 Cytochrome P450 5A1 TBXAS1 TXA synthase TXS Thromboxane A2 Synthase (P450 TxA2) Thromboxane prostanoid Thromboxane-A synthase
Type:
Enzyme
Mol. Mass.:
60524.67
Organism:
Homo sapiens (Human)
Description:
P24557
Residue:
533
  
Inhibitor
Name:
BDBM50008790
Synonyms:
5-[Pyridin-4-yl-(3-trifluoromethyl-phenyl)-methyleneaminooxy]-pentanoic acid(R 68070) | CHEMBL299224
Type:
Small organic molecule
Emp. Form.:
C18H17F3N2O3
Mol. Mass.:
366.3344
SMILES:
OC(=O)CCCCO\N=C(/c1ccncc1)c1cccc(c1)C(F)(F)F
: