Target
Mu-type opioid receptor
Ligand
BDBM50008894
Substrate
Meas. Tech.
ChEMBL_146259 (CHEMBL757483)
Ki
>10000±n/a nM
Citation
 Vecchietti, VGiordani, AGiardina, GColle, RClarke, GD (2S)-1-(arylacetyl)-2-(aminomethyl)piperidine derivatives: novel, highly selective kappa opioid analgesics. J Med Chem 34:397-403 (1991)  
Target
Name:
Mu-type opioid receptor
Synonyms:
M-OR-1 Mu opioid receptor OPIATE Mu OPRM_CAVPO
Type:
Enzyme Catalytic Domain
Mol. Mass.:
11165.58
Organism:
GUINEA PIG
Description:
P97266
Residue:
98
  
Inhibitor
Name:
BDBM50008894
Synonyms:
1-(2-Pyrrolidin-1-ylmethyl-piperidin-1-yl)-2-p-tolyl-ethanone(HCl) | CHEMBL337841
Type:
Small organic molecule
Emp. Form.:
C19H28N2O
Mol. Mass.:
300.4384
SMILES:
Cc1ccc(CC(=O)N2CCCCC2CN2CCCC2)cc1
: