Target
Mu-type opioid receptor
Ligand
BDBM50000278
Substrate
Meas. Tech.
ChEMBL_145288 (CHEMBL752957)
Ki
4810±n/a nM
Citation
 Vecchietti, VGiordani, AGiardina, GColle, RClarke, GD (2S)-1-(arylacetyl)-2-(aminomethyl)piperidine derivatives: novel, highly selective kappa opioid analgesics. J Med Chem 34:397-403 (1991)  
Target
Name:
Mu-type opioid receptor
Synonyms:
M-OR-1 Mu opioid receptor OPIATE Mu OPRM_CAVPO
Type:
Enzyme Catalytic Domain
Mol. Mass.:
11165.58
Organism:
GUINEA PIG
Description:
P97266
Residue:
98
  
Inhibitor
Name:
BDBM50000278
Synonyms:
2-(3,4-Dichloro-phenyl)-1-(2-piperidin-1-ylmethyl-piperidin-1-yl)-ethanone CHEMBL131328
Type:
Small organic molecule
Emp. Form.:
C19H26Cl2N2O
Mol. Mass.:
369.329
SMILES:
Clc1ccc(CC(=O)N2CCCCC2CN2CCCCC2)cc1Cl
: