Target
Mu-type opioid receptor
Ligand
BDBM50008889
Substrate
Meas. Tech.
ChEMBL_146259 (CHEMBL757483)
Ki
762±n/a nM
Citation
 Vecchietti, VGiordani, AGiardina, GColle, RClarke, GD (2S)-1-(arylacetyl)-2-(aminomethyl)piperidine derivatives: novel, highly selective kappa opioid analgesics. J Med Chem 34:397-403 (1991)  
Target
Name:
Mu-type opioid receptor
Synonyms:
M-OR-1 Mu opioid receptor OPIATE Mu OPRM_CAVPO
Type:
Enzyme Catalytic Domain
Mol. Mass.:
11165.58
Organism:
GUINEA PIG
Description:
P97266
Residue:
98
  
Inhibitor
Name:
BDBM50008889
Synonyms:
(threo)2-(3,4-Dichloro-phenyl)-1-[2-(1-dimethylamino-ethyl)-piperidin-1-yl]-ethanone(HCl) CHEMBL131034
Type:
Small organic molecule
Emp. Form.:
C17H24Cl2N2O
Mol. Mass.:
343.291
SMILES:
CC(C1CCCCN1C(=O)Cc1ccc(Cl)c(Cl)c1)N(C)C
: