Target
DNA topoisomerase 2-alpha
Ligand
BDBM50259247
Substrate
Meas. Tech.
ChEBML_1691217
IC50
1950±n/a nM
Citation
 Yu, XZhang, MAnnamalai, TBansod, PNarula, GTse-Dinh, YCSun, D Synthesis, evaluation, and CoMFA study of fluoroquinophenoxazine derivatives as bacterial topoisomerase IA inhibitors. Eur J Med Chem 125:515-527 (2017)  
Target
Name:
DNA topoisomerase 2-alpha
Synonyms:
DNA topoisomerase 2-alpha DNA topoisomerase II (Topo II) DNA topoisomerase II, alpha isozyme TOP2A Topoisomerase I/II | Topoisomerase II alpha (HuTopoIIα)
Type:
Protein
Mol. Mass.:
174415.30
Organism:
Homo sapiens (Human)
Description:
P11388
Residue:
1531
  
Inhibitor
Name:
BDBM50259247
Synonyms:
CHEMBL4065223 | US10266550, Compound 11g
Type:
Small organic molecule
Emp. Form.:
C26H27FN4O4
Mol. Mass.:
478.5154
SMILES:
Nc1ccc2c(c1)oc1c(N3CCC(CC3)N3CCCCC3)c(F)cc3c1n2cc(C(O)=O)c3=O
: