Target
Polyunsaturated fatty acid 5-lipoxygenase
Ligand
BDBM50008954
Substrate
Meas. Tech.
ChEBML_736
IC50
8100±n/a nM
Citation
 Flynn, DLBelliotti, TRBoctor, AMConnor, DTKostlan, CRNies, DEOrtwine, DFSchrier, DJSircar, JC Styrylpyrazoles, styrylisoxazoles, and styrylisothiazoles. Novel 5-lipoxygenase and cyclooxygenase inhibitors. J Med Chem 34:518-25 (1991)  
Target
Name:
Polyunsaturated fatty acid 5-lipoxygenase
Synonyms:
Alox5 LOX5_RAT
Type:
PROTEIN
Mol. Mass.:
78082.31
Organism:
Rattus norvegicus
Description:
ChEMBL_1432947
Residue:
673
  
Inhibitor
Name:
BDBM50008954
Synonyms:
3-(3,5-Di-tert-butyl-4-hydroxy-benzylidene)-1-methoxy-pyrrolidin-2-one CHEMBL12594 | E-5110
Type:
Small organic molecule
Emp. Form.:
C20H29NO3
Mol. Mass.:
331.4492
SMILES:
CON1CC\C(=C/c2cc(c(O)c(c2)C(C)(C)C)C(C)(C)C)C1=O
: