Target
Prostaglandin G/H synthase 1/2
Ligand
BDBM50008955
Substrate
Meas. Tech.
ChEMBL_158267 (CHEMBL762447)
IC50
16000±n/a nM
Citation
 Flynn, DLBelliotti, TRBoctor, AMConnor, DTKostlan, CRNies, DEOrtwine, DFSchrier, DJSircar, JC Styrylpyrazoles, styrylisoxazoles, and styrylisothiazoles. Novel 5-lipoxygenase and cyclooxygenase inhibitors. J Med Chem 34:518-25 (1991)  
Target
Name:
Prostaglandin G/H synthase 1/2
Synonyms:
Cyclooxygenase
Type:
Mol. Mass.:
Description:
ASSAY_ID of ChEMBL is 1666355
Components:
This complex has 2 components.
Component 1
Name:
Prostaglandin G/H synthase 2
Synonyms:
Cox-2 Cyclooxygenase Ptgs2
Type:
Enzyme Catalytic Domain
Mol. Mass.:
69173.51
Organism:
RAT
Description:
COX-2 0 RAT::P35355
Residue:
604
  
Component 2
Name:
Prostaglandin G/H synthase 1
Synonyms:
Cox-1 Cyclooxygenase PGH1_RAT Ptgs1
Type:
Enzyme Catalytic Domain
Mol. Mass.:
69033.56
Organism:
RAT
Description:
COX-1 0 RAT::Q63921
Residue:
602
  
Inhibitor
Name:
BDBM50008955
Synonyms:
2,6-Dibromo-4-[2-(3-methyl-isoxazol-5-yl)-vinyl]-phenol | CHEMBL149945
Type:
Small organic molecule
Emp. Form.:
C12H9Br2NO2
Mol. Mass.:
359.013
SMILES:
Cc1cc(\C=C\c2cc(Br)c(O)c(Br)c2)on1
: