Target
Histamine H4 receptor
Ligand
BDBM50259296
Substrate
Meas. Tech.
ChEMBL_1691276 (CHEMBL4041925)
EC50
6750±n/a nM
Citation
 Levoin, NLabeeuw, OBillot, XCalmels, TDanvy, DKrief, SBerrebi-Bertrand, ILecomte, JMSchwartz, JCCapet, M Discovery of nanomolar ligands with novel scaffolds for the histamine H4 receptor by virtual screening. Eur J Med Chem 125:565-572 (2017)  
Target
Name:
Histamine H4 receptor
Synonyms:
AXOR35 GPCR105 HH4R HRH4 Histamine H4 receptor Histamine receptor (H3 and H4) SP9144
Type:
G Protein-Coupled Receptor (GPCR)
Mol. Mass.:
44517.02
Organism:
Homo sapiens (Human)
Description:
Binding assays were using CHO cells stably expressing hH4R receptors.
Residue:
390
  
Inhibitor
Name:
BDBM50259296
Synonyms:
CHEMBL4077914
Type:
Small organic molecule
Emp. Form.:
C20H21N3O2
Mol. Mass.:
335.3996
SMILES:
COc1ccc(\C(=N\[C@H](C)Cc2cnc[nH]2)c2ccccc2)c(O)c1
: