Target
Transmembrane domain-containing protein TMIGD3
Ligand
BDBM50259311
Substrate
Meas. Tech.
ChEMBL_1691284 (CHEMBL4041933)
Ki
67±n/a nM
Citation
 Poli, DFalsini, MVarano, FBetti, MVarani, KVincenzi, FPugliese, AMPedata, FDal Ben, DThomas, APalchetti, IBettazzi, FCatarzi, DColotta, V Imidazo[1,2-a]pyrazin-8-amine core for the design of new adenosine receptor antagonists: Structural exploration to target the A Eur J Med Chem 125:611-628 (2017)  
Target
Name:
Transmembrane domain-containing protein TMIGD3
Synonyms:
TMIG3_HUMAN Transmembrane domain-containing protein TMIGD3
Type:
PROTEIN
Mol. Mass.:
30335.79
Organism:
Homo sapiens (Human)
Description:
ChEMBL_114868
Residue:
266
  
Inhibitor
Name:
BDBM50259311
Synonyms:
CHEMBL4105423
Type:
Small organic molecule
Emp. Form.:
C23H16N4O2
Mol. Mass.:
380.3987
SMILES:
O=C(Nc1nc(cn2cc(nc12)-c1ccccc1)-c1ccccc1)c1ccco1
: