Target
Adenosine receptor A2a
Ligand
BDBM50259300
Substrate
Meas. Tech.
ChEBML_1691283
Ki
520±n/a nM
Citation
 Poli, DFalsini, MVarano, FBetti, MVarani, KVincenzi, FPugliese, AMPedata, FDal Ben, DThomas, APalchetti, IBettazzi, FCatarzi, DColotta, V Imidazo[1,2-a]pyrazin-8-amine core for the design of new adenosine receptor antagonists: Structural exploration to target the A Eur J Med Chem 125:611-628 (2017)  
Target
Name:
Adenosine receptor A2a
Synonyms:
A2A adenosine receptor (hA2A) ADENOSINE A2 ADORA2 Adenosine A2A receptor (A2AAR)
Type:
G Protein-Coupled Receptor (GPCR)
Mol. Mass.:
44716.46
Organism:
Homo sapiens (Human)
Description:
P29274
Residue:
412
  
Inhibitor
Name:
BDBM50259300
Synonyms:
CHEMBL4101016
Type:
Small organic molecule
Emp. Form.:
C16H12N4O
Mol. Mass.:
276.2927
SMILES:
Nc1nc(cn2cc(nc12)-c1ccco1)-c1ccccc1
: