Target
Dual specificity protein kinase CLK3
Ligand
BDBM50259410
Substrate
Meas. Tech.
ChEBML_1691312
IC50
3900±n/a nM
Citation
 Bendjeddou, LZLoaëc, NVilliers, BPrina, ESpäth, GFGalons, HMeijer, LOumata, N Exploration of the imidazo[1,2-b]pyridazine scaffold as a protein kinase inhibitor. Eur J Med Chem 125:696-709 (2017)  
Target
Name:
Dual specificity protein kinase CLK3
Synonyms:
CDC-like kinase 3 Clk3
Type:
PROTEIN
Mol. Mass.:
73855.32
Organism:
Mus musculus
Description:
ChEMBL_1502247
Residue:
638
  
Inhibitor
Name:
BDBM50259410
Synonyms:
CHEMBL4100956
Type:
Small organic molecule
Emp. Form.:
C15H17N5O
Mol. Mass.:
283.3284
SMILES:
CC[C@@H](CO)Nc1ccc2ncc(-c3cccnc3)n2n1
: