Target
Dual specificity tyrosine-phosphorylation-regulated kinase 3
Ligand
BDBM50259410
Substrate
Meas. Tech.
ChEBML_1691317
IC50
950±n/a nM
Citation
 Bendjeddou, LZLoaëc, NVilliers, BPrina, ESpäth, GFGalons, HMeijer, LOumata, N Exploration of the imidazo[1,2-b]pyridazine scaffold as a protein kinase inhibitor. Eur J Med Chem 125:696-709 (2017)  
Target
Name:
Dual specificity tyrosine-phosphorylation-regulated kinase 3
Synonyms:
DYRK3 Dual-specificity tyrosine-phosphorylation regulated kinase 3
Type:
PROTEIN
Mol. Mass.:
65747.26
Organism:
Homo sapiens (Human)
Description:
ChEMBL_1508026
Residue:
588
  
Inhibitor
Name:
BDBM50259410
Synonyms:
CHEMBL4100956
Type:
Small organic molecule
Emp. Form.:
C15H17N5O
Mol. Mass.:
283.3284
SMILES:
CC[C@@H](CO)Nc1ccc2ncc(-c3cccnc3)n2n1
: