Target
Potassium-transporting ATPase alpha chain 1/subunit beta
Ligand
BDBM50009026
Substrate
Meas. Tech.
ChEMBL_76052 (CHEMBL687659)
IC50
20000±n/a nM
Citation
 Sih, JCIm, WBRobert, AGraber, DRBlakeman, DP Studies on (H(+)-K+)-ATPase inhibitors of gastric acid secretion. Prodrugs of 2-[(2-pyridinylmethyl)sulfinyl]benzimidazole proton-pump inhibitors. J Med Chem 34:1049-62 (1991)  
Target
Name:
Potassium-transporting ATPase alpha chain 1/subunit beta
Synonyms:
Potassium-transporting ATPase | Potassium-transporting ATPase alpha chain 1/beta chain
Type:
Mol. Mass.:
Description:
Components:
This complex has 0 components.
Component 1
Name:
Potassium-transporting ATPase subunit beta
Synonyms:
ATP4B Gastric H(+)/K(+) ATPase subunit beta Potassium-transporting ATPase beta chain Proton pump beta chain | gp60-90
Type:
Mol. Mass.:
33083.09
Organism:
Sus scrofa (Pig)
Description:
Residue:
290
  
Component 2
Name:
Potassium-transporting ATPase alpha chain 1
Synonyms:
ATP4A Gastric H(+)/K(+) ATPase subunit alpha Na/K-ATPase Potassium-transporting ATPase alpha chain 1 | Proton pump
Type:
Enzyme
Mol. Mass.:
114279.23
Organism:
Sus scrofa (Pig)
Description:
P19156
Residue:
1034
  
Inhibitor
Name:
BDBM50009026
Synonyms:
2-(4-Methoxy-3,5-dimethyl-pyridin-2-ylmethanesulfinyl)-1H-benzoimidazole | CHEMBL10184
Type:
Small organic molecule
Emp. Form.:
C16H17N3O2S
Mol. Mass.:
315.39
SMILES:
COc1c(C)cnc(CS(=O)c2nc3ccccc3[nH]2)c1C
: