Target
Cysteinyl leukotriene receptor 1
Ligand
BDBM50291847
Substrate
Meas. Tech.
ChEBML_52358
Ki
0.100000±n/a nM
Citation
 Huang, FCGalemmo, RAPoli, GBLearn, KSMorrissette, MMJohnson, WHDankulich, WPCampbell, HFCarnathan, GWVanInwegen, RG Development of a novel series of (2-quinolinylmethoxy)phenyl-containing compounds as high-affinity leukotriene D4 receptor antagonists. 4. Addition of chromone moiety enhances leukotriene D4 receptor binding affinity. J Med Chem 34:1704-7 (1991)  
Target
Name:
Cysteinyl leukotriene receptor 1
Synonyms:
CLTR1_CAVPO | CYSLTR1
Type:
Enzyme Catalytic Domain
Mol. Mass.:
39007.58
Organism:
GUINEA PIG
Description:
Leukotriene D4 0 GUINEA PIG::Q2NNR5
Residue:
340
  
Inhibitor
Name:
BDBM50291847
Synonyms:
7-[3-(Quinolin-2-ylmethoxy)-benzyloxy]-2-(1H-tetrazol-5-yl)-chroman-4-one | CHEMBL47430
Type:
Small organic molecule
Emp. Form.:
C27H21N5O4
Mol. Mass.:
479.4867
SMILES:
O=C1CC(Oc2cc(OCc3cccc(OCc4ccc5ccccc5n4)c3)ccc12)c1nnn[nH]1
: