Target
Cysteinyl leukotriene receptor 1
Ligand
BDBM50291857
Substrate
Meas. Tech.
ChEBML_52358
Ki
18±n/a nM
Citation
 Huang, FCGalemmo, RAPoli, GBLearn, KSMorrissette, MMJohnson, WHDankulich, WPCampbell, HFCarnathan, GWVanInwegen, RG Development of a novel series of (2-quinolinylmethoxy)phenyl-containing compounds as high-affinity leukotriene D4 receptor antagonists. 4. Addition of chromone moiety enhances leukotriene D4 receptor binding affinity. J Med Chem 34:1704-7 (1991)  
Target
Name:
Cysteinyl leukotriene receptor 1
Synonyms:
CLTR1_CAVPO | CYSLTR1
Type:
Enzyme Catalytic Domain
Mol. Mass.:
39007.58
Organism:
GUINEA PIG
Description:
Leukotriene D4 0 GUINEA PIG::Q2NNR5
Residue:
340
  
Inhibitor
Name:
BDBM50291857
Synonyms:
6-Chloro-4-oxo-5-[4-(quinolin-2-ylmethoxy)-benzyloxy]-chroman-2-carboxylic acid | CHEMBL295664
Type:
Small organic molecule
Emp. Form.:
C27H20ClNO6
Mol. Mass.:
489.904
SMILES:
OC(=O)C1CC(=O)c2c(O1)ccc(Cl)c2OCc1ccc(OCc2ccc3ccccc3n2)cc1
: