Target
Signal transduction protein TRAP
Ligand
BDBM50260000
Substrate
Meas. Tech.
ChEBML_1692280
EC50
76700±n/a nM
Citation
 Vermote, ABrackman, GRisseeuw, MDCappoen, DCos, PCoenye, TVan Calenbergh, S Novel Potentiators for Vancomycin in the Treatment of Biofilm-Related MRSA Infections via a Mix and Match Approach. ACS Med Chem Lett 8:38-42 (2017)  
Target
Name:
Signal transduction protein TRAP
Synonyms:
Signal transduction protein TRAP Target of RNAIII-activating protein | traP
Type:
PROTEIN
Mol. Mass.:
19547.99
Organism:
Staphylococcus aureus (strain Mu50 / ATCC 700699)
Description:
ChEMBL_117552
Residue:
167
  
Inhibitor
Name:
BDBM50260000
Synonyms:
CHEMBL4092720
Type:
Small organic molecule
Emp. Form.:
C18H19ClN2O6
Mol. Mass.:
394.806
SMILES:
O[C@@H]1[C@@H](CNC(=O)c2ccccc2Cl)OC[C@@]1(O)CNC(=O)c1ccoc1
: