Target
3-hydroxy-3-methylglutaryl-coenzyme A reductase
Ligand
BDBM50009408
Substrate
Meas. Tech.
ChEBML_80666
IC50
269±n/a nM
Citation
 Lee, TJHoltz, WJSmith, RLAlberts, AWGilfillan, JL 3-Hydroxy-3-methylglutaryl-coenzyme A reductase inhibitors. 8. Side chain ether analogues of lovastatin. J Med Chem 34:2474-7 (1991)  
Target
Name:
3-hydroxy-3-methylglutaryl-coenzyme A reductase
Synonyms:
HMDH_RAT Hmgcr
Type:
Enzyme
Mol. Mass.:
96689.85
Organism:
Rattus norvegicus (rat)
Description:
Isolated rat liver microsomes were used as enzyme source.
Residue:
887
  
Inhibitor
Name:
BDBM50009408
Synonyms:
Acetic acid 8-[2-(4-hydroxy-6-oxo-tetrahydro-pyran-2-yl)-ethyl]-3,7-dimethyl-1,2,3,7,8,8a-hexahydro-naphthalen-1-yl ester | CHEMBL310601
Type:
Small organic molecule
Emp. Form.:
C21H30O5
Mol. Mass.:
362.4599
SMILES:
C[C@@H]1C[C@H](OC(C)=O)[C@@H]2[C@@H](CCC3C[C@@H](O)CC(=O)O3)[C@@H](C)C=CC2=C1
: