Target
3-hydroxy-3-methylglutaryl-coenzyme A reductase
Ligand
BDBM50009413
Substrate
Meas. Tech.
ChEBML_80666
IC50
19±n/a nM
Citation
 Lee, TJHoltz, WJSmith, RLAlberts, AWGilfillan, JL 3-Hydroxy-3-methylglutaryl-coenzyme A reductase inhibitors. 8. Side chain ether analogues of lovastatin. J Med Chem 34:2474-7 (1991)  
Target
Name:
3-hydroxy-3-methylglutaryl-coenzyme A reductase
Synonyms:
HMDH_RAT Hmgcr
Type:
Enzyme
Mol. Mass.:
96689.85
Organism:
Rattus norvegicus (rat)
Description:
Isolated rat liver microsomes were used as enzyme source.
Residue:
887
  
Inhibitor
Name:
BDBM50009413
Synonyms:
CHEMBL3085466 | Phenyl-acetic acid 8-[2-(4-hydroxy-6-oxo-tetrahydro-pyran-2-yl)-ethyl]-3,7-dimethyl-1,2,3,7,8,8a-hexahydro-naphthalen-1-yl ester
Type:
Small organic molecule
Emp. Form.:
C27H34O5
Mol. Mass.:
438.5559
SMILES:
[H][C@]12[C@H](C[C@@H](C)C=C1C=C[C@H](C)[C@@H]2CC[C@@H]1C[C@@H](O)CC(=O)O1)OC(=O)Cc1ccccc1
: