Target
3-hydroxy-3-methylglutaryl-coenzyme A reductase
Ligand
BDBM50009420
Substrate
Meas. Tech.
ChEBML_80659
IC50
13±n/a nM
Citation
 Duggan, MEAlberts, AWBostedor, RChao, YSGermershausen, JIGilfillan, JLHalczenko, WHartman, GDHunt, VImagire, JS 3-Hydroxy-3-methylglutaryl-coenzyme a reductase inhibitors. 7. Modification of the hexahydronaphthalene moiety of simvastatin: 5-oxygenated and 5-oxa derivatives. J Med Chem 34:2489-95 (1991)  
Target
Name:
3-hydroxy-3-methylglutaryl-coenzyme A reductase
Synonyms:
HMDH_RAT Hmgcr
Type:
Enzyme
Mol. Mass.:
96689.85
Organism:
Rattus norvegicus (rat)
Description:
Isolated rat liver microsomes were used as enzyme source.
Residue:
887
  
Inhibitor
Name:
BDBM50009420
Synonyms:
2,2-Dimethyl-butyric acid 8-[2-(4-hydroxy-6-oxo-tetrahydro-pyran-2-yl)-ethyl]-3,7-dimethyl-decahydro-naphthalen-1-yl ester | CHEMBL3349543
Type:
Small organic molecule
Emp. Form.:
C25H42O5
Mol. Mass.:
422.598
SMILES:
CCC(C)(C)C(=O)O[C@H]1C[C@@H](C)CC2CC[C@H](C)[C@H](CC[C@@H]3C[C@@H](O)CC(=O)O3)C12
: