Target
3-hydroxy-3-methylglutaryl-coenzyme A reductase
Ligand
BDBM50406550
Substrate
Meas. Tech.
ChEBML_80659
IC50
6±n/a nM
Citation
 Duggan, MEAlberts, AWBostedor, RChao, YSGermershausen, JIGilfillan, JLHalczenko, WHartman, GDHunt, VImagire, JS 3-Hydroxy-3-methylglutaryl-coenzyme a reductase inhibitors. 7. Modification of the hexahydronaphthalene moiety of simvastatin: 5-oxygenated and 5-oxa derivatives. J Med Chem 34:2489-95 (1991)  
Target
Name:
3-hydroxy-3-methylglutaryl-coenzyme A reductase
Synonyms:
HMDH_RAT Hmgcr
Type:
Enzyme
Mol. Mass.:
96689.85
Organism:
Rattus norvegicus (rat)
Description:
Isolated rat liver microsomes were used as enzyme source.
Residue:
887
  
Inhibitor
Name:
BDBM50406550
Synonyms:
CHEMBL2114188 | CHEMBL3349570
Type:
Small organic molecule
Emp. Form.:
C31H46O6S
Mol. Mass.:
546.758
SMILES:
[H][C@@]12CC[C@H](C)[C@H](CC[C@@H]3C[C@@H](O)CC(=O)O3)C1[C@H](C[C@](C)(CSc1ccccc1)O2)OC(=O)C(C)(C)CC
: