Target
Glutamate receptor ionotropic, NMDA 1
Ligand
BDBM50009592
Substrate
Meas. Tech.
ChEMBL_154063 (CHEMBL761034)
Ki
617±n/a nM
Citation
 Iorio, MATomassini, LMattson, MVGeorge, CJacobson, AE Synthesis, stereochemistry, and biological activity of the 1-(1-phenyl-2-methylcyclohexyl)piperidines and the 1-(1-phenyl-4-methylcyclohexyl)piperidines. Absolute configuration of the potent trans-(-)-1-(1-phenyl-2-methylcyclohexyl)piperidine. J Med Chem 34:2615-23 (1991)  
Target
Name:
Glutamate receptor ionotropic, NMDA 1
Synonyms:
Glutamate (NMDA) receptor subunit zeta 1 Glutamate-NMDA-Channel Glutamate-NMDA-Polyamine NMDA Nmdar1 | phencyclidine
Type:
Enzyme Catalytic Domain
Mol. Mass.:
105533.40
Organism:
RAT
Description:
P35439
Residue:
938
  
Inhibitor
Name:
BDBM50009592
Synonyms:
CHEMBL424610 trans-1-(4-Methyl-1-phenyl-cyclohexyl)-piperidine
Type:
Small organic molecule
Emp. Form.:
C18H27N
Mol. Mass.:
257.4137
SMILES:
CC1CCC(CC1)(N1CCCCC1)c1ccccc1
: