Target
Glutamate receptor ionotropic, NMDA 1
Ligand
BDBM50009590
Substrate
Meas. Tech.
ChEMBL_154062 (CHEMBL761033)
Ki
4700±n/a nM
Citation
 Iorio, MATomassini, LMattson, MVGeorge, CJacobson, AE Synthesis, stereochemistry, and biological activity of the 1-(1-phenyl-2-methylcyclohexyl)piperidines and the 1-(1-phenyl-4-methylcyclohexyl)piperidines. Absolute configuration of the potent trans-(-)-1-(1-phenyl-2-methylcyclohexyl)piperidine. J Med Chem 34:2615-23 (1991)  
Target
Name:
Glutamate receptor ionotropic, NMDA 1
Synonyms:
Glutamate (NMDA) receptor subunit zeta 1 Glutamate-NMDA-Channel Glutamate-NMDA-Polyamine NMDA Nmdar1 | phencyclidine
Type:
Enzyme Catalytic Domain
Mol. Mass.:
105533.40
Organism:
RAT
Description:
P35439
Residue:
938
  
Inhibitor
Name:
BDBM50009590
Synonyms:
CHEMBL86824 trans-C-(2-Methyl-1-piperidin-1-yl-cyclohexyl)-C-phenyl-methyleneamine
Type:
Small organic molecule
Emp. Form.:
C19H28N2
Mol. Mass.:
284.439
SMILES:
CC1CCCCC1(N1CCCCC1)C(=N)c1ccccc1
: