Target
Vesicular acetylcholine transporter
Ligand
BDBM50009598
Substrate
Meas. Tech.
ChEBML_213552
IC50
520±n/a nM
Citation
 Efange, SMMichelson, RHDutta, AKParsons, SM Acyclic analogues of 2-(4-phenylpiperidino)cyclohexanol (vesamicol): conformationally mobile inhibitors of vesicular acetylcholine transport. J Med Chem 34:2638-43 (1991)  
Target
Name:
Vesicular acetylcholine transporter
Synonyms:
TorVAChT VAChT
Type:
PROTEIN
Mol. Mass.:
56111.93
Organism:
Torpedo californica
Description:
ChEMBL_1503355
Residue:
515
  
Inhibitor
Name:
BDBM50009598
Synonyms:
3-[2-Hydroxy-3-(4-phenyl-piperidin-1-yl)-propyl]-phenol | CHEMBL88522
Type:
Small organic molecule
Emp. Form.:
C20H25NO2
Mol. Mass.:
311.418
SMILES:
OC(CN1CCC(CC1)c1ccccc1)Cc1cccc(O)c1
: