Target
Vesicular acetylcholine transporter
Ligand
BDBM50009603
Substrate
Meas. Tech.
ChEBML_213552
IC50
73±n/a nM
Citation
 Efange, SMMichelson, RHDutta, AKParsons, SM Acyclic analogues of 2-(4-phenylpiperidino)cyclohexanol (vesamicol): conformationally mobile inhibitors of vesicular acetylcholine transport. J Med Chem 34:2638-43 (1991)  
Target
Name:
Vesicular acetylcholine transporter
Synonyms:
TorVAChT VAChT
Type:
PROTEIN
Mol. Mass.:
56111.93
Organism:
Torpedo californica
Description:
ChEMBL_1503355
Residue:
515
  
Inhibitor
Name:
BDBM50009603
Synonyms:
1-(3-Bromo-phenyl)-3-(4-phenyl-piperidin-1-yl)-propan-2-ol | CHEMBL84797
Type:
Small organic molecule
Emp. Form.:
C20H24BrNO
Mol. Mass.:
374.315
SMILES:
OC(CN1CCC(CC1)c1ccccc1)Cc1cccc(Br)c1
: