Target
Aromatase
Ligand
BDBM50009616
Substrate
Meas. Tech.
ChEBML_50537
IC50
3000±n/a nM
Citation
 Bayer, HBatzl, CHartmann, RWMannschreck, A New aromatase inhibitors. Synthesis and biological activity of pyridyl-substituted tetralone derivatives. J Med Chem 34:2685-91 (1991)  
Target
Name:
Aromatase
Synonyms:
ARO1 CP19A_HUMAN CYP19 CYPXIX Cytochrome P450 19A1 Cytochrome P450-C19 (CYP19) FL cytokine receptor precursor | P-450AROM
Type:
Enzyme
Mol. Mass.:
57888.92
Organism:
Homo sapiens (Human)
Description:
P11511
Residue:
503
  
Inhibitor
Name:
BDBM50009616
Synonyms:
7-Hydroxy-2-pyridin-4-ylmethylene-3,4-dihydro-2H-naphthalen-1-one | CHEMBL313774
Type:
Small organic molecule
Emp. Form.:
C16H13NO2
Mol. Mass.:
251.2799
SMILES:
Oc1ccc2CC\C(=C/c3ccncc3)C(=O)c2c1
: