Target
Aromatase
Ligand
BDBM50009614
Substrate
Meas. Tech.
ChEBML_50537
IC50
4300±n/a nM
Citation
 Bayer, HBatzl, CHartmann, RWMannschreck, A New aromatase inhibitors. Synthesis and biological activity of pyridyl-substituted tetralone derivatives. J Med Chem 34:2685-91 (1991)  
Target
Name:
Aromatase
Synonyms:
ARO1 CP19A_HUMAN CYP19 CYPXIX Cytochrome P450 19A1 Cytochrome P450-C19 (CYP19) FL cytokine receptor precursor | P-450AROM
Type:
Enzyme
Mol. Mass.:
57888.92
Organism:
Homo sapiens (Human)
Description:
P11511
Residue:
503
  
Inhibitor
Name:
BDBM50009614
Synonyms:
2-Pyridin-4-ylmethyl-3,4-dihydro-2H-naphthalen-1-one | CHEMBL92065
Type:
Small organic molecule
Emp. Form.:
C16H15NO
Mol. Mass.:
237.2964
SMILES:
O=C1C(Cc2ccncc2)CCc2ccccc12
: