Target
Renin
Ligand
BDBM50009620
Substrate
Meas. Tech.
ChEBML_195978
pH
7.4±n/a
IC50
610±n/a nM
Comments
extracted
Citation
 Weber, AEHalgren, TADoyle, JJLynch, RJSiegl, PKParsons, WHGreenlee, WJPatchett, AA Design and synthesis of P2-P1'-linked macrocyclic human renin inhibitors. J Med Chem 34:2692-701 (1991)  
Target
Name:
Renin
Synonyms:
Angiotensinogenase RENI_HUMAN
Type:
Enzyme
Mol. Mass.:
45058.99
Organism:
Homo sapiens (Human)
Description:
Residue:
406
  
Inhibitor
Name:
BDBM50009620
Synonyms:
CHEMBL431854 | [1-(11-Cyclohexylmethyl-12-hydroxy-5,9,13-trioxo-1-oxa-4,10-diaza-cyclotridec-8-ylcarbamoyl)-2-phenyl-ethyl]-carbamic acid tert-butyl ester
Type:
Small organic molecule
Emp. Form.:
C31H46N4O8
Mol. Mass.:
602.7189
SMILES:
CC(C)(C)OC(=O)N[C@@H](Cc1ccccc1)C(=O)N[C@H]1CCC(=O)NCCOC(=O)[C@H](O)[C@H](CC2CCCCC2)NC1=O
: