Target
Kappa-type opioid receptor
Ligand
BDBM50009674
Substrate
Meas. Tech.
ChEBML_145349
Ki
3730±n/a nM
Citation
 Jacobson, ARTam, SWSayre, LM Modification of the enkephalin"message" with an artificial polycationic C-terminus. J Med Chem 34:2816-21 (1991)  
Target
Name:
Kappa-type opioid receptor
Synonyms:
Kappa Opioid Receptor OPRK1 Opiate Kappa 1 | mu/kappa opioid receptor
Type:
G Protein-Coupled Receptor (GPCR)
Mol. Mass.:
42744.99
Organism:
Cavia porcellus (domestic guinea pig)
Description:
P41144
Residue:
380
  
Inhibitor
Name:
BDBM50009674
Synonyms:
4-Amino-N-[2-(4-amino-butyrylamino)-ethyl]-N-[2-((4-amino-butyryl)-{2-[2-(2-{2-[2-amino-3-(4-hydroxy-phenyl)-propionylamino]-acetylamino}-acetylamino)-3-phenyl-propionylamino]-ethyl}-amino)-ethyl]-butyramide | CHEMBL97363
Type:
Small organic molecule
Emp. Form.:
C40H63N11O8
Mol. Mass.:
825.9971
SMILES:
NCCCC(=O)NCCN(CCN(CCNC(=O)[C@H](Cc1ccccc1)NC(=O)CNC(=O)CNC(=O)[C@@H](N)Cc1ccc(O)cc1)C(=O)CCCN)C(=O)CCCN
: