Target
Adenosine receptor A1
Ligand
BDBM50009706
Substrate
Meas. Tech.
ChEBML_28553
IC50
20100±n/a nM
Citation
 Harden, FAQuinn, RJScammells, PJ Synthesis and adenosine receptor affinity of a series of pyrazolo[3,4-d]pyrimidine analogues of 1-methylisoguanosine. J Med Chem 34:2892-8 (1991)  
Target
Name:
Adenosine receptor A1
Synonyms:
AA1R_RAT ADENOSINE A1 high Adenosine A1 receptor (A1) Adenosine receptors A1 | Adora1
Type:
Protein
Mol. Mass.:
36704.13
Organism:
Rattus norvegicus (rat)
Description:
Residue:
326
  
Inhibitor
Name:
BDBM50009706
Synonyms:
4-Amino-5-ethyl-1-phenyl-1,5-dihydro-pyrazolo[3,4-d]pyrimidin-6-one | CHEMBL95590
Type:
Small organic molecule
Emp. Form.:
C13H13N5O
Mol. Mass.:
255.2752
SMILES:
CCn1c(N)c2cnn(-c3ccccc3)c2nc1=O
: