Target
Adenosine receptor A2a/A2b
Ligand
BDBM50009706
Substrate
Meas. Tech.
ChEMBL_30537 (CHEMBL643184)
IC50
81800±n/a nM
Citation
 Harden, FAQuinn, RJScammells, PJ Synthesis and adenosine receptor affinity of a series of pyrazolo[3,4-d]pyrimidine analogues of 1-methylisoguanosine. J Med Chem 34:2892-8 (1991)  
Target
Name:
Adenosine receptor A2a/A2b
Synonyms:
Adenosine A2 receptor
Type:
Mol. Mass.:
Description:
ASSAY_ID of ChEMBL is 30560
Components:
This complex has 2 components.
Component 1
Name:
Adenosine receptor A2b
Synonyms:
AA2BR_RAT Adora2b
Type:
PROTEIN
Mol. Mass.:
36378.84
Organism:
Rattus norvegicus
Description:
ChEMBL_32934
Residue:
332
  
Component 2
Name:
Adenosine receptor A2a
Synonyms:
AA2AR_RAT Adenosine A2 receptor Adenosine Receptors A2a (A2a) Adenosine receptors A2a Rat striatal adenosine A2a receptor
Type:
G Protein-Coupled Receptor (GPCR)
Mol. Mass.:
45015.65
Organism:
Rattus norvegicus (rat)
Description:
Rat A2A receptors expressed in CHO cells.
Residue:
410
  
Inhibitor
Name:
BDBM50009706
Synonyms:
4-Amino-5-ethyl-1-phenyl-1,5-dihydro-pyrazolo[3,4-d]pyrimidin-6-one | CHEMBL95590
Type:
Small organic molecule
Emp. Form.:
C13H13N5O
Mol. Mass.:
255.2752
SMILES:
CCn1c(N)c2cnn(-c3ccccc3)c2nc1=O
: