Target
Amine oxidase [flavin-containing] A
Ligand
BDBM50009742
Substrate
Meas. Tech.
ChEBML_123445
IC50
30000±n/a nM
Citation
 Harfenist, MMcGee, DPWhite, HL A selective, reversible, competitive inhibitor of monoamine oxidase A containing no nitrogen, with negligible potentiation of tyramine-induced blood pressure rise. J Med Chem 34:2931-3 (1991)  
Target
Name:
Amine oxidase [flavin-containing] A
Synonyms:
AOFA_RAT Amine oxidase [flavin-containing] A Monoamine Oxidase Type A (MAO-A) Monoamine oxidase A (MAO-A) Monoamine oxidase type A (MAOA)
Type:
Enzyme
Mol. Mass.:
59515.21
Organism:
Rattus norvegicus (rat)
Description:
Residue:
526
  
Inhibitor
Name:
BDBM50009742
Synonyms:
(10,10-Dioxo-10H-10lambda*6*-phenoxathiin-1-yl)-acetic acid | CHEMBL67295
Type:
Small organic molecule
Emp. Form.:
C14H10O5S
Mol. Mass.:
290.291
SMILES:
OC(=O)Cc1cccc2Oc3ccccc3S(=O)(=O)c12
: