Target
Amine oxidase [flavin-containing] A
Ligand
BDBM50009745
Substrate
Meas. Tech.
ChEBML_123445
IC50
40±n/a nM
Citation
 Harfenist, MMcGee, DPWhite, HL A selective, reversible, competitive inhibitor of monoamine oxidase A containing no nitrogen, with negligible potentiation of tyramine-induced blood pressure rise. J Med Chem 34:2931-3 (1991)  
Target
Name:
Amine oxidase [flavin-containing] A
Synonyms:
AOFA_RAT Amine oxidase [flavin-containing] A Monoamine Oxidase Type A (MAO-A) Monoamine oxidase A (MAO-A) Monoamine oxidase type A (MAOA)
Type:
Enzyme
Mol. Mass.:
59515.21
Organism:
Rattus norvegicus (rat)
Description:
Residue:
526
  
Inhibitor
Name:
BDBM50009745
Synonyms:
1-Vinyl-phenoxathiine 10,10-dioxide | CHEMBL66723
Type:
Small organic molecule
Emp. Form.:
C14H10O3S
Mol. Mass.:
258.292
SMILES:
C=Cc1cccc2Oc3ccccc3S(=O)(=O)c12
: