Target
Aldo-keto reductase family 1 member B1
Ligand
BDBM50009767
Substrate
Meas. Tech.
ChEBML_157078
IC50
70.0±n/a nM
Citation
 Mylari, BLLarson, ERBeyer, TAZembrowski, WJAldinger, CEDee, MFSiegel, TWSingleton, DH Novel, potent aldose reductase inhibitors: 3,4-dihydro-4-oxo-3-[[5-(trifluoromethyl)-2-benzothiazolyl] methyl]-1-phthalazineacetic acid (zopolrestat) and congeners. J Med Chem 34:108-22 (1991)  
Target
Name:
Aldo-keto reductase family 1 member B1
Synonyms:
AKR1B1 ALDR_HUMAN AR Aldose Reductase (ALR2) Aldose reductase (AR)
Type:
Protein
Mol. Mass.:
35855.50
Organism:
Homo sapiens (Human)
Description:
P15121. 4LAU; 2IKI; 4LB4; 2FZD; 2FZ8; 1US0
Residue:
316
  
Inhibitor
Name:
BDBM50009767
Synonyms:
2-(4-oxo-3-((6-(trifluoromethyl)benzo[d]thiazol-2-yl)methyl)-3,4-dihydrophthalazin-1-yl)acetic acid [4-Oxo-3-(6-trifluoromethyl-benzothiazol-2-ylmethyl)-3,4-dihydro-phthalazin-1-yl]-acetic acid
Type:
Small organic molecule
Emp. Form.:
C19H12F3N3O3S
Mol. Mass.:
419.377
SMILES:
OC(=O)Cc1nn(Cc2nc3ccc(cc3s2)C(F)(F)F)c(=O)c2ccccc12
: